使用 Node 18 版本的 node-sass 安装错误

npm install node-sass

npm WARN deprecated har-validator@5.1.5: this library is no longer supported

npm WARN deprecated uuid@3.4.0: Please upgrade  to version 7 or higher.  Older versions may use Math.random() in certain circumstances, which is known to be problematic.  See https://v8.dev/blog/math-random for details.

npm WARN deprecated request@2.88.2: request has been deprecated, see https://github.com/request/request/issues/3142

npm ERR! code 1

npm ERR! path D:RNDredux-toolkitnode_modulesnode-sass

npm ERR! command failed

npm ERR! command C:WINDOWSsystem32cmd.exe /d /s /c node scripts/build.js

npm ERR! Building: C:Program Filesnodejsnode.exe D:RNDredux-toolkitnode_modulesnode-gypbinnode-gyp.js rebuild --verbose --libsass_ext= --libsass_cflags= --libsass_ldflags= --libsass_library=

npm ERR! gyp info it worked if it ends with ok

npm ERR! gyp verb cli [

npm ERR! gyp verb cli   'C:Program Filesnodejsnode.exe',

npm ERR! gyp verb cli   'D:RNDredux-toolkitnode_modulesnode-gypbinnode-gyp.js',

npm ERR! gyp verb cli   'rebuild',

npm ERR! gyp verb cli   '--verbose',

npm ERR! gyp verb cli   '--libsass_ext=',

npm ERR! gyp verb cli   '--libsass_cflags=',

npm ERR! gyp verb cli   '--libsass_ldflags=',

npm ERR! gyp verb cli   '--libsass_library='

npm ERR! gyp verb cli ]

npm ERR! gyp info using node-gyp@8.4.1

npm ERR! gyp info using node@18.1.0 | win32 | x64

npm ERR! gyp verb command rebuild []

npm ERR! gyp verb command clean []

npm ERR! gyp verb clean removing "build" directory

npm ERR! gyp verb command configure []

npm ERR! gyp verb find Python Python is not set from command line or npm configuration

npm ERR! gyp verb find Python Python is not set from environment variable PYTHON

npm ERR! gyp verb find Python checking if "python3" can be used

npm ERR! gyp verb find Python - executing "python3" to get executable path

npm ERR! gyp verb find Python - "python3" is not in PATH or produced an error

npm ERR! gyp verb find Python checking if "python" can be used

npm ERR! gyp verb find Python - executing "python" to get executable path

npm ERR! gyp verb find Python - "python" is not in PATH or produced an error

npm ERR! gyp verb find Python checking if Python is C:UsersAdminAppDataLocalProgramsPythonPython39python.exe

npm ERR! gyp verb find Python - executing "C:UsersAdminAppDataLocalProgramsPythonPython39python.exe" to get version

npm ERR! gyp verb find Python - "C:UsersAdminAppDataLocalProgramsPythonPython39python.exe" could not be run

npm ERR! gyp verb find Python checking if Python is C:Program FilesPython39python.exe

npm ERR! gyp verb find Python - executing "C:Program FilesPython39python.exe" to get version

npm ERR! gyp verb find Python - "C:Program FilesPython39python.exe" could not be run

npm ERR! gyp verb find Python checking if Python is C:UsersAdminAppDataLocalProgramsPythonPython39-32python.exe

npm ERR! gyp verb find Python - executing "C:UsersAdminAppDataLocalProgramsPythonPython39-32python.exe" to get version

npm ERR! gyp verb find Python - "C:UsersAdminAppDataLocalProgramsPythonPython39-32python.exe" could not be run
npm ERR! gyp verb find Python checking if Python is C:Program FilesPython39-32python.exe
npm ERR! gyp verb find Python - executing "C:Program FilesPython39-32python.exe" to get version
npm ERR! gyp verb find Python - "C:Program FilesPython39-32python.exe" could not be run
npm ERR! gyp verb find Python checking if Python is C:Program Files (x86)Python39-32python.exe
npm ERR! gyp verb find Python - executing "C:Program Files (x86)Python39-32python.exe" to get version
npm ERR! gyp verb find Python - "C:Program Files (x86)Python39-32python.exe" could not be run
npm ERR! gyp verb find Python checking if Python is 

C:UsersAdminAppDataLocalProgramsPythonPython38python.exe

npm ERR! gyp verb find Python - executing 

"C:UsersAdminAppDataLocalProgramsPythonPython38python.exe" to get version

npm ERR! gyp verb find Python - 

"C:UsersAdminAppDataLocalProgramsPythonPython38python.exe" could not be run

npm ERR! gyp verb find Python checking if Python is C:Program FilesPython38python.exe

npm ERR! gyp verb find Python - executing "C:Program FilesPython38python.exe" to get version

npm ERR! gyp verb find Python - "C:Program FilesPython38python.exe" could not be run

npm ERR! gyp verb find Python checking if Python is 

C:UsersAdminAppDataLocalProgramsPythonPython38-32python.exe

npm ERR! gyp verb find Python - executing 

"C:UsersAdminAppDataLocalProgramsPythonPython38-32python.exe" to get version
npm ERR! gyp verb find Python - "C:UsersAdminAppDataLocalProgramsPythonPython38-32python.exe" could not be run

npm ERR! gyp verb find Python checking if Python is C:Program FilesPython38-32python.exe

npm ERR! gyp verb find Python - executing "C:Program FilesPython38-32python.exe" to get version

npm ERR! gyp verb find Python - "C:Program FilesPython38-32python.exe" could not be run

npm ERR! gyp verb find Python checking if Python is C:Program Files (x86)Python38-32python.exe

npm ERR! gyp verb find Python - executing "C:Program Files (x86)Python38-32python.exe" to get version

npm ERR! gyp verb find Python - "C:Program Files (x86)Python38-32python.exe" could not be run

npm ERR! gyp verb find Python checking if Python is C:UsersAdminAppDataLocalProgramsPythonPython37python.exe

npm ERR! gyp verb find Python - executing "C:UsersAdminAppDataLocalProgramsPythonPython37python.exe" to get version

npm ERR! gyp verb find Python - "C:UsersAdminAppDataLocalProgramsPythonPython37python.exe" could not be run

npm ERR! gyp verb find Python checking if Python is C:Program FilesPython37python.exe

npm ERR! gyp verb find Python - executing "C:Program FilesPython37python.exe" to get version

npm ERR! gyp verb find Python - "C:Program FilesPython37python.exe" could not be run

npm ERR! gyp verb find Python checking if Python is C:UsersAdminAppDataLocalProgramsPythonPython37-32python.exe

npm ERR! gyp verb find Python - executing "C:UsersAdminAppDataLocalProgramsPythonPython37-32python.exe" to get version

npm ERR! gyp verb find Python - "C:UsersAdminAppDataLocalProgramsPythonPython37-32python.exe" could not be run

npm ERR! gyp verb find Python checking if Python is C:Program FilesPython37-32python.exe

npm ERR! gyp verb find Python - executing "C:Program FilesPython37-32python.exe" to get version

npm ERR! gyp verb find Python - "C:Program FilesPython37-32python.exe" could not be run

npm ERR! gyp verb find Python checking if Python is C:Program Files (x86)Python37-32python.exe

npm ERR! gyp verb find Python - executing "C:Program Files (x86)Python37-32python.exe" to get version

npm ERR! gyp verb find Python - "C:Program Files (x86)Python37-32python.exe" could not be run

npm ERR! gyp verb find Python checking if Python is C:UsersAdminAppDataLocalProgramsPythonPython36python.exe

npm ERR! gyp verb find Python - executing "C:UsersAdminAppDataLocalProgramsPythonPython36python.exe" to get version

npm ERR! gyp verb find Python - "C:UsersAdminAppDataLocalProgramsPythonPython36python.exe" could not be run

npm ERR! gyp verb find Python checking if Python is C:Program FilesPython36python.exe

npm ERR! gyp verb find Python - executing "C:Program FilesPython36python.exe" to get version

npm ERR! gyp verb find Python - "C:Program FilesPython36python.exe" could not be run

npm ERR! gyp verb find Python checking if Python is C:UsersAdminAppDataLocalProgramsPythonPython36-32python.exe

npm ERR! gyp verb find Python - executing "C:UsersAdminAppDataLocalProgramsPythonPython36-32python.exe" to get version

npm ERR! gyp verb find Python - "C:UsersAdminAppDataLocalProgramsPythonPython36-32python.exe" could not be run

npm ERR! gyp verb find Python checking if Python is C:Program FilesPython36-32python.exe

npm ERR! gyp verb find Python - executing "C:Program FilesPython36-32python.exe" to get version

npm ERR! gyp verb find Python - "C:Program FilesPython36-32python.exe" could not be run

npm ERR! gyp verb find Python checking if Python is C:Program Files (x86)Python36-32python.exe

npm ERR! gyp verb find Python - executing "C:Program Files (x86)Python36-32python.exe" to get version

npm ERR! gyp verb find Python - "C:Program Files (x86)Python36-32python.exe" could not be run

npm ERR! gyp verb find Python checking if the py launcher can be used to find Python 3

npm ERR! gyp verb find Python - executing "py.exe" to get Python 3 executable path

npm ERR! gyp verb find Python - "py.exe" is not in PATH or produced an error

npm ERR! gyp ERR! find Python

npm ERR! gyp ERR! find Python Python is not set from command line or npm configuration

npm ERR! gyp ERR! find Python Python is not set from environment variable PYTHON

npm ERR! gyp ERR! find Python checking if "python3" can be used

npm ERR! gyp ERR! find Python - "python3" is not in PATH or produced an error

npm ERR! gyp ERR! find Python checking if "python" can be used

npm ERR! gyp ERR! find Python - "python" is not in PATH or produced an error

npm ERR! gyp ERR! find Python checking if Python is C:UsersAdminAppDataLocalProgramsPythonPython39python.exe

npm ERR! gyp ERR! find Python - "C:UsersAdminAppDataLocalProgramsPythonPython39python.exe" could not be run

npm ERR! gyp ERR! find Python checking if Python is C:Program FilesPython39python.exe

npm ERR! gyp ERR! find Python - "C:Program FilesPython39python.exe" could not be run
npm ERR! gyp ERR! find Python checking if Python is 
C:UsersAdminAppDataLocalProgramsPythonPython39-32python.exe

npm ERR! gyp ERR! find Python - "C:UsersAdminAppDataLocalProgramsPythonPython39-32python.exe" could not be run

npm ERR! gyp ERR! find Python checking if Python is C:Program FilesPython39-32python.exe

npm ERR! gyp ERR! find Python - "C:Program FilesPython39-32python.exe" could not be run

npm ERR! gyp ERR! find Python checking if Python is C:Program Files (x86)Python39-32python.exe

npm ERR! gyp ERR! find Python - "C:Program Files (x86)Python39-32python.exe" could not be run

npm ERR! gyp ERR! find Python checking if Python is C:UsersAdminAppDataLocalProgramsPythonPython38python.exe

npm ERR! gyp ERR! find Python - "C:UsersAdminAppDataLocalProgramsPythonPython38python.exe" could not be run

npm ERR! gyp ERR! find Python checking if Python is C:Program FilesPython38python.exe

npm ERR! gyp ERR! find Python - "C:Program FilesPython38python.exe" could not be run

npm ERR! gyp ERR! find Python checking if Python is C:UsersAdminAppDataLocalProgramsPythonPython38-32python.exe

npm ERR! gyp ERR! find Python - "C:UsersAdminAppDataLocalProgramsPythonPython38-32python.exe" could not be run

npm ERR! gyp ERR! find Python checking if Python is C:Program FilesPython38-32python.exe

npm ERR! gyp ERR! find Python - "C:Program FilesPython38-32python.exe" could not be run

npm ERR! gyp ERR! find Python checking if Python is C:Program Files (x86)Python38-32python.exe

npm ERR! gyp ERR! find Python - "C:Program Files (x86)Python38-32python.exe" could not be run

npm ERR! gyp ERR! find Python checking if Python is C:UsersAdminAppDataLocalProgramsPythonPython37python.exe

npm ERR! gyp ERR! find Python - "C:UsersAdminAppDataLocalProgramsPythonPython37python.exe" could not be run

npm ERR! gyp ERR! find Python checking if Python is C:Program FilesPython37python.exe

npm ERR! gyp ERR! find Python - "C:Program FilesPython37python.exe" could not be run

npm ERR! gyp ERR! find Python checking if Python is C:UsersAdminAppDataLocalProgramsPythonPython37-32python.exe

npm ERR! gyp ERR! find Python - "C:UsersAdminAppDataLocalProgramsPythonPython37-32python.exe" could not be run

npm ERR! gyp ERR! find Python checking if Python is C:Program FilesPython37-32python.exe

npm ERR! gyp ERR! find Python - "C:Program FilesPython37-32python.exe" could not be run

npm ERR! gyp ERR! find Python checking if Python is C:Program Files (x86)Python37-32python.exe

npm ERR! gyp ERR! find Python - "C:Program Files (x86)Python37-32python.exe" could not be run

npm ERR! gyp ERR! find Python checking if Python is C:UsersAdminAppDataLocalProgramsPythonPython36python.exe

npm ERR! gyp ERR! find Python - "C:UsersAdminAppDataLocalProgramsPythonPython36python.exe" could not be run

npm ERR! gyp ERR! find Python checking if Python is C:Program FilesPython36python.exe

npm ERR! gyp ERR! find Python - "C:Program FilesPython36python.exe" could not be run

npm ERR! gyp ERR! find Python checking if Python is C:UsersAdminAppDataLocalProgramsPythonPython36-32python.exe

npm ERR! gyp ERR! find Python - "C:UsersAdminAppDataLocalProgramsPythonPython36-32python.exe" could not be run

npm ERR! gyp ERR! find Python checking if Python is C:Program FilesPython36-32python.exe

npm ERR! gyp ERR! find Python - "C:Program FilesPython36-32python.exe" could not be run

npm ERR! gyp ERR! find Python checking if Python is C:Program Files (x86)Python36-32python.exe

npm ERR! gyp ERR! find Python - "C:Program Files (x86)Python36-32python.exe" could not be run

npm ERR! gyp ERR! find Python checking if the py launcher can be used to find Python 3

npm ERR! gyp ERR! find Python - "py.exe" is not in PATH or produced an error

npm ERR! gyp ERR! find Python

npm ERR! gyp ERR! find Python **********************************************************

npm ERR! gyp ERR! find Python You need to install the latest version of Python.

npm ERR! gyp ERR! find Python Node-gyp should be able to find and use Python. If not,

npm ERR! gyp ERR! find Python you can try one of the following options:

npm ERR! gyp ERR! find Python - Use the switch --python="C:PathTopython.exe"

npm ERR! gyp ERR! find Python   (accepted by both node-gyp and npm)

npm ERR! gyp ERR! find Python - Set the environment variable PYTHON

npm ERR! gyp ERR! find Python - Set the npm configuration variable python:

npm ERR! gyp ERR! find Python   npm config set python "C:PathTopython.exe"

npm ERR! gyp ERR! find Python For more information consult the documentation at:

npm ERR! gyp ERR! find Python https://github.com/nodejs/node-gyp#installation

npm ERR! gyp ERR! find Python **********************************************************

npm ERR! gyp ERR! find Python

npm ERR! gyp ERR! configure error

npm ERR! gyp ERR! stack Error: Could not find any Python installation to use

npm ERR! gyp ERR! stack     at PythonFinder.fail (D:RNDredux-toolkitnode_modulesnode-gyplibfind-python.js:330:47)

npm ERR! gyp ERR! stack     at PythonFinder.runChecks (D:RNDredux-toolkitnode_modulesnode-gyplibfind-python.js:159:21)

npm ERR! gyp ERR! stack     at PythonFinder.<anonymous> (D:RNDredux-toolkitnode_modulesnode-gyplibfind-python.js:228:18)

npm ERR! gyp ERR! stack     at PythonFinder.execFileCallback (D:RNDredux-toolkitnode_modulesnode-gyplibfind-python.js:294:16)

npm ERR! gyp ERR! stack     at exithandler (node:child_process:395:5)

npm ERR! gyp ERR! stack     at ChildProcess.errorhandler (node:child_process:407:5)

npm ERR! gyp ERR! stack     at ChildProcess.emit (node:events:527:28)

npm ERR! gyp ERR! stack     at ChildProcess._handle.onexit (node:internal/child_process:289:12)

npm ERR! gyp ERR! stack     at onErrorNT (node:internal/child_process:476:16)

npm ERR! gyp ERR! stack     at process.processTicksAndRejections (node:internal/process/task_queues:82:21)

npm ERR! gyp ERR! System Windows_NT 10.0.19044

npm ERR! gyp ERR! command "C:Program Filesnodejsnode.exe" "D:RNDredux-toolkitnode_modulesnode-gypbinnode-gyp.js" "rebuild" "--verbose" "--libsass_ext=" "--libsass_cflags=" "--libsass_ldflags=" "--libsass_library="

npm ERR! gyp ERR! cwd D:RNDredux-toolkitnode_modulesnode-sass

npm ERR! gyp ERR! node -v v18.1.0

npm ERR! gyp ERR! node-gyp -v v8.4.1

npm ERR! gyp ERR! not ok

npm ERR! Build failed with error code: 1

npm ERR! A complete log of this run can be found in:

npm ERR!     C:UsersAdminAppDataLocalnpm-cache_logs2022-06-02T09_17_47_530Z-debug-0.log
stack overflow node-sass install ERROR with Node 18 version
原文答案

答案:

作者头像

不要使用 node-sass

node-sass 已弃用且不受支持。而是使用 sass 的新版本。

您可以使用此命令卸载旧的并安装新的

npm uninstall node-sass
npm install sass
作者头像

https://github.com/sass/node-sass/pull/3257 登陆并将 v8.0 版本推送到 NPM 之前,将不支持node 18

作者头像

npm 卸载 node-sass npm 安装 sass